BDBM50247029 2beta-Carbo(2-fluoroethoxy)-3beta-(3'-((Z)-2-bromoethenyl)phenyl)-nortropane::CHEMBL525952
SMILES FCCOC(=O)C1C2CCC(CC1c1cccc(\C=C/Br)c1)N2
InChI Key InChIKey=SPQWIGAZLYFACO-SREVYHEPSA-N
Data  3 KI
  Tab Delimited (TSV)   2D SDfile   Computed 3D by Vconf -m prep SDfile
Find this compound or compounds like it in BindingDB:
Activity Spreadsheet -- Enzyme Inhibition Constant Data from BindingDB
Found 1 hit for monomerid = 50247029
TargetSodium-dependent noradrenaline transporter(Homo sapiens (Human))
Emory University
Curated by ChEMBL
LigandPNGBDBM50247029(2beta-Carbo(2-fluoroethoxy)-3beta-(3'-((Z)-2-bromo...)
Affinity DataKi:  101nM. Assay description: Displacement of [3H]nisoxetine from human NET transfected in human HEK293 cells
In DepthDetails ArticlePubMed